Reaction Details
TargetDelta-type opioid receptor
LigandBDBM50190366
Substrate/Competitorn/a
Meas. Tech.ChEMBL_376241 (CHEMBL869294)
Ki>10000±n/a nM
Citation Zhang, QKeenan, SMPeng, YNair, ACYu, SJHowells, RDWelsh, WJ Discovery of novel triazole-based opioid receptor antagonists. J Med Chem49:4044-7 (2006) 
 
Delta-type opioid receptor
Name:Delta-type opioid receptor
Type:G Protein-Coupled Receptor (GPCR)
Mol. Mass.:40382.98
Organism:Homo sapiens (Human)
Description:Competition binding assays were carried out using membrane preparations from transfected HN9.10 cells that constitutively expressed the delta opioid receptor.
Residue:372
BDBM50190366
NameBDBM50190366
Synonyms:1-{3-[4-(tert-butyl)phenyl]-5-N,N-dimethylamino-(1,2,4-triazol-4-yl)}-3-methoxybenzene | CHEMBL211673
TypeSmall organic molecule
Emp. Form.C21H26N4O
Mol. Mass.350.4573
SMILESCOc1cccc(c1)-n1c(nnc1-c1ccc(cc1)C(C)(C)C)N(C)C