Reaction Details
TargetKappa-type opioid receptor
LigandBDBM50190368
Substrate/Competitorn/a
Meas. Tech.ChEMBL_376243 (CHEMBL869298)
Ki>10000±n/a nM
Citation Zhang, QKeenan, SMPeng, YNair, ACYu, SJHowells, RDWelsh, WJ Discovery of novel triazole-based opioid receptor antagonists. J Med Chem49:4044-7 (2006) 
 
Kappa-type opioid receptor
Name:Kappa-type opioid receptor
Type:G Protein-Coupled Receptor (GPCR)
Mol. Mass.:42648.76
Organism:Homo sapiens (Human)
Description:P41145
Residue:380
BDBM50190368
NameBDBM50190368
Synonyms:1-[(3-naphthalen-2-yl)-(1,2,4-triazol-4-yl) ]-3-phenol | CHEMBL379717
TypeSmall organic molecule
Emp. Form.C18H13N3O
Mol. Mass.287.3153
SMILESOc1cccc(c1)-n1cnnc1-c1ccc2ccccc2c1