Reaction Details
TargetMu-type opioid receptor
LigandBDBM50190372
Substrate/Competitorn/a
Meas. Tech.ChEMBL_376242 (CHEMBL869296)
Ki>10000±n/a nM
Citation Zhang, QKeenan, SMPeng, YNair, ACYu, SJHowells, RDWelsh, WJ Discovery of novel triazole-based opioid receptor antagonists. J Med Chem49:4044-7 (2006) 
 
Mu-type opioid receptor
Name:Mu-type opioid receptor
Type:G Protein-Coupled Receptor (GPCR)
Mol. Mass.:44789.51
Organism:Homo sapiens (Human)
Description:P35372
Residue:400
BDBM50190372
NameBDBM50190372
Synonyms:1-{3-[4-(tert-butyl)phenyl]-5-[(4-N-methyl)piperazin-1-yl]-(1,2,4-triazol-4-yl)}-3-phenol | CHEMBL211669
TypeSmall organic molecule
Emp. Form.C23H29N5O
Mol. Mass.391.5093
SMILESCN1CCN(CC1)c1nnc(-c2ccc(cc2)C(C)(C)C)n1-c1cccc(O)c1