Reaction Details
TargetMu-type opioid receptor
LigandBDBM50190370
Substrate/Competitorn/a
Meas. Tech.ChEMBL_376242 (CHEMBL869296)
Ki 4000±n/a nM
Citation Zhang, QKeenan, SMPeng, YNair, ACYu, SJHowells, RDWelsh, WJ Discovery of novel triazole-based opioid receptor antagonists. J Med Chem49:4044-7 (2006) 
 
Mu-type opioid receptor
Name:Mu-type opioid receptor
Type:G Protein-Coupled Receptor (GPCR)
Mol. Mass.:44789.51
Organism:Homo sapiens (Human)
Description:P35372
Residue:400
BDBM50190370
NameBDBM50190370
Synonyms:1-{3-[4-(tert-butyl) phenyl]-5-N,N-dimethylamino-(1,2,4-triazol-4-yl)}-3-phenol | CHEMBL377904
TypeSmall organic molecule
Emp. Form.C20H24N4O
Mol. Mass.336.4308
SMILESCN(C)c1nnc(-c2ccc(cc2)C(C)(C)C)n1-c1cccc(O)c1