Reaction Details
Target5-hydroxytryptamine receptor 1A
LigandBDBM50191623
Substrate/Competitorn/a
Meas. Tech.ChEMBL_376264 (CHEMBL864775)
Ki 2.1±n/a nM
Citation Hatzenbuhler, NTEvrard, DAHarrison, BLHuryn, DInghrim, JKraml, CMattes, JFMewshaw, REZhou, DHornby, GLin, QSmith, DLSullivan, KMSchechter, LEBeyer, CEAndree, TH Synthesis and biological evaluation of novel compounds within a class of 3-aminochroman derivatives with dual 5-HT1A receptor and serotonin transporter affinity. J Med Chem49:4785-9 (2006) 
 
5-hydroxytryptamine receptor 1A
Name:5-hydroxytryptamine receptor 1A
Type:n/a
Mol. Mass.:46122.49
Organism:Homo sapiens (Human)
Description:n/a
Residue:422
BDBM50191623
NameBDBM50191623
Synonyms:CHEMBL385353 | rac-3-{(cyclopropylmethyl)[4-(5-fluoro-1H-indol-3-yl)butyl]amino}-8-fluorochromane-5-carboxamide
TypeSmall organic molecule
Emp. Form.C26H29F2N3O2
Mol. Mass.453.5242
SMILESNC(=O)c1ccc(F)c2OCC(Cc12)N(CCCCc1c[nH]c2ccc(F)cc12)CC1CC1