Reaction Details
Target5-hydroxytryptamine receptor 1A
LigandBDBM50191627
Substrate/Competitorn/a
Meas. Tech.ChEMBL_376264 (CHEMBL864775)
Ki 2.14±n/a nM
Citation Hatzenbuhler, NTEvrard, DAHarrison, BLHuryn, DInghrim, JKraml, CMattes, JFMewshaw, REZhou, DHornby, GLin, QSmith, DLSullivan, KMSchechter, LEBeyer, CEAndree, TH Synthesis and biological evaluation of novel compounds within a class of 3-aminochroman derivatives with dual 5-HT1A receptor and serotonin transporter affinity. J Med Chem49:4785-9 (2006) 
 
5-hydroxytryptamine receptor 1A
Name:5-hydroxytryptamine receptor 1A
Type:n/a
Mol. Mass.:46122.49
Organism:Homo sapiens (Human)
Description:n/a
Residue:422
BDBM50191627
NameBDBM50191627
Synonyms:(3R)-(-)-N-Cyclobutyl-N-[3-(5-fluoro-1H-indol-3-yl)propyl]-5-methoxychroman-3-amine CHEMBL211363
TypeSmall organic molecule
Emp. Form.C25H29FN2O2
Mol. Mass.408.5084
SMILESCOc1cccc2OC[C@@H](Cc12)N(CCCc1c[nH]c2ccc(F)cc12)C1CCC1