Reaction Details
TargetSodium-dependent serotonin transporter
LigandBDBM50191638
Substrate/Competitorn/a
Meas. Tech.ChEMBL_376262 (CHEMBL864773)
Ki 3.9±n/a nM
Citation Hatzenbuhler, NTEvrard, DAHarrison, BLHuryn, DInghrim, JKraml, CMattes, JFMewshaw, REZhou, DHornby, GLin, QSmith, DLSullivan, KMSchechter, LEBeyer, CEAndree, TH Synthesis and biological evaluation of novel compounds within a class of 3-aminochroman derivatives with dual 5-HT1A receptor and serotonin transporter affinity. J Med Chem49:4785-9 (2006) 
 
Sodium-dependent serotonin transporter
Name:Sodium-dependent serotonin transporter
Type:Multi-pass membrane protein
Mol. Mass.:70168.43
Organism:Rattus norvegicus (rat)
Description:P31652
Residue:630
BDBM50191638
NameBDBM50191638
Synonyms:(3R)-3-{(cyclopropylmethyl)[3-(5-fluoro-1H-indol-3-yl)propyl]amino}-8-fluorochromane-5-carboxamide | CHEMBL209802
TypeSmall organic molecule
Emp. Form.C25H27F2N3O2
Mol. Mass.439.4976
SMILESNC(=O)c1ccc(F)c2OC[C@@H](Cc12)N(CCCc1c[nH]c2ccc(F)cc12)CC1CC1