Reaction Details
TargetSodium-dependent serotonin transporter
LigandBDBM50191625
Substrate/Competitorn/a
Meas. Tech.ChEMBL_376262 (CHEMBL864773)
Ki 0.4±n/a nM
Citation Hatzenbuhler, NTEvrard, DAHarrison, BLHuryn, DInghrim, JKraml, CMattes, JFMewshaw, REZhou, DHornby, GLin, QSmith, DLSullivan, KMSchechter, LEBeyer, CEAndree, TH Synthesis and biological evaluation of novel compounds within a class of 3-aminochroman derivatives with dual 5-HT1A receptor and serotonin transporter affinity. J Med Chem49:4785-9 (2006) 
 
Sodium-dependent serotonin transporter
Name:Sodium-dependent serotonin transporter
Type:Multi-pass membrane protein
Mol. Mass.:70168.43
Organism:Rattus norvegicus (rat)
Description:P31652
Residue:630
BDBM50191625
NameBDBM50191625
Synonyms:CHEMBL208605 | rac-3-{ethyl[4-(5-fluoro-1H-indol-3-yl)butyl]amino}-8-fluorochromane-5-carboxamide
TypeSmall organic molecule
Emp. Form.C24H27F2N3O2
Mol. Mass.427.4869
SMILESCCN(CCCCc1c[nH]c2ccc(F)cc12)C1COc2c(F)ccc(C(N)=O)c2C1