Reaction Details
TargetNociceptin receptor
LigandBDBM50189257
Substrate/Competitorn/a
Meas. Tech.ChEMBL_378705 (CHEMBL853453)
Ki 0.300000±n/a nM
Citation Crooks, PAKottayil, SGAl-Ghananeem, AMByrn, SRButterfield, DA Opiate receptor binding properties of morphine-, dihydromorphine-, and codeine 6-O-sulfate ester congeners. Bioorg Med Chem Lett16:4291-5 (2006) 
 
Nociceptin receptor
Name:Nociceptin receptor
Type:PROTEIN
Mol. Mass.:40796.89
Organism:Cavia porcellus
Description:ChEMBL_444577
Residue:370
BDBM50189257
NameBDBM50189257
Synonyms:CHEMBL378753 | NalBzOH
TypeSmall organic molecule
Emp. Form.C26H27N3O4
Mol. Mass.445.5103
SMILESOc1ccc2CC3N(CC=C)CCC45[C@H](Oc1c24)C(CCC35O)=NNC(=O)c1ccccc1