Reaction Details
TargetNociceptin receptor
LigandBDBM50381677
Substrate/Competitorn/a
Meas. Tech.ChEMBL_378705 (CHEMBL853453)
Ki 1099±n/a nM
Citation Crooks, PAKottayil, SGAl-Ghananeem, AMByrn, SRButterfield, DA Opiate receptor binding properties of morphine-, dihydromorphine-, and codeine 6-O-sulfate ester congeners. Bioorg Med Chem Lett16:4291-5 (2006) 
 
Nociceptin receptor
Name:Nociceptin receptor
Type:PROTEIN
Mol. Mass.:40796.89
Organism:Cavia porcellus
Description:ChEMBL_444577
Residue:370
BDBM50381677
NameBDBM50381677
Synonyms:CHEMBL1256748 | U-69593
TypeSmall organic molecule
Emp. Form.C22H32N2O2
Mol. Mass.356.5017
SMILESCN([C@H]1C[C@@]2(CCCO2)CC[C@@H]1N1CCCC1)C(=O)Cc1ccccc1