Reaction Details
TargetSodium-dependent dopamine transporter
LigandBDBM50124566
Substrate/Competitorn/a
Meas. Tech.ChEMBL_379064 (CHEMBL863614)
IC50>25000±n/a nM
Citation Fray, MJBish, GFish, PVStobie, AWakenhut, FWhitlock, GA Structure-activity relationships of N-substituted piperazine amine reuptake inhibitors. Bioorg Med Chem Lett16:4349-53 (2006) 
 
Sodium-dependent dopamine transporter
Name:Sodium-dependent dopamine transporter
Type:Multi-pass membrane protein
Mol. Mass.:68497.11
Organism:Homo sapiens (Human)
Description:Q01959
Residue:620
BDBM50124566
NameBDBM50124566
Synonyms:(R)-2-((R)-(2-ethoxyphenoxy)(phenyl)methyl)morpholine 2-((2-ethoxyphenoxy)(phenyl)methyl)morpholine 2-[2-ethoxyphenoxy(phenyl)methyl]-1,4-oxazinane REBOXETINE | rac-syn-2-((2-ethoxyphenoxy)(phenyl)methyl)morpholine
TypeSmall organic molecule
Emp. Form.C19H23NO3
Mol. Mass.313.3908
SMILESCCOc1ccccc1OC(C1CNCCO1)c1ccccc1