Reaction Details
TargetSodium-dependent serotonin transporter
LigandBDBM50188098
Substrate/Competitorn/a
Meas. Tech.ChEMBL_379062 (CHEMBL863612)
IC50 13±n/a nM
Citation Fray, MJBish, GFish, PVStobie, AWakenhut, FWhitlock, GA Structure-activity relationships of N-substituted piperazine amine reuptake inhibitors. Bioorg Med Chem Lett16:4349-53 (2006) 
 
Sodium-dependent serotonin transporter
Name:Sodium-dependent serotonin transporter
Type:Multi-pass membrane protein
Mol. Mass.:70322.51
Organism:Homo sapiens (Human)
Description:P31645
Residue:630
BDBM50188098
NameBDBM50188098
Synonyms:(R)-1-(2-(2-ethoxyphenyl)-1-phenylethyl)piperazine hydrochloride CHEMBL534723
TypeSmall organic molecule
Emp. Form.C20H26N2O
Mol. Mass.310.4332
SMILESCCOc1ccccc1C[C@@H](N1CCNCC1)c1ccccc1