Reaction Details
TargetExtracellular calcium-sensing receptor
LigandBDBM50193407
Substrate/Competitorn/a
Meas. Tech.ChEMBL_382280 (CHEMBL866784)
IC50 5400±n/a nM
Citation Kessler, AFaure, HPetrel, CRognan, DCésario, MRuat, MDauban, PDodd, RH N1-Benzoyl-N2-[1-(1-naphthyl)ethyl]-trans-1,2-diaminocyclohexanes: Development of 4-chlorophenylcarboxamide (calhex 231) as a new calcium sensing receptor ligand demonstrating potent calcilytic activity. J Med Chem49:5119-28 (2006) 
 
Extracellular calcium-sensing receptor
Name:Extracellular calcium-sensing receptor
Type:PROTEIN
Mol. Mass.:120858.46
Organism:Rattus norvegicus
Description:ChEMBL_750426
Residue:1079
BDBM50193407
NameBDBM50193407
Synonyms:CHEMBL537426 | N1-[4-(trifluoromethoxy)benzenesulfonyl)-N2-[1-(1-naphthyl)ethyl]-trans-1,2-diaminocyclohexane hydrochloride
TypeSmall organic molecule
Emp. Form.C25H27F3N2O3S
Mol. Mass.492.554
SMILESCC(N[C@@H]1CCCC[C@H]1NS(=O)(=O)c1ccc(OC(F)(F)F)cc1)c1cccc2ccccc12