Reaction Details
TargetExtracellular calcium-sensing receptor
LigandBDBM50193411
Substrate/Competitorn/a
Meas. Tech.ChEMBL_382280 (CHEMBL866784)
IC50 330±n/a nM
Citation Kessler, AFaure, HPetrel, CRognan, DCésario, MRuat, MDauban, PDodd, RH N1-Benzoyl-N2-[1-(1-naphthyl)ethyl]-trans-1,2-diaminocyclohexanes: Development of 4-chlorophenylcarboxamide (calhex 231) as a new calcium sensing receptor ligand demonstrating potent calcilytic activity. J Med Chem49:5119-28 (2006) 
 
Extracellular calcium-sensing receptor
Name:Extracellular calcium-sensing receptor
Type:PROTEIN
Mol. Mass.:120858.46
Organism:Rattus norvegicus
Description:ChEMBL_750426
Residue:1079
BDBM50193411
NameBDBM50193411
Synonyms:3,4-dichloro-N-((1S,2S)-2-((R)-1-(naphthalen-1-yl)ethylamino)cyclohexyl)benzamide hydrochloride | CHEMBL537870
TypeSmall organic molecule
Emp. Form.C25H26Cl2N2O
Mol. Mass.441.393
SMILESC[C@@H](N[C@H]1CCCC[C@@H]1NC(=O)c1ccc(Cl)c(Cl)c1)c1cccc2ccccc12