Reaction Details
Target2-dehydropantoate 2-reductase
LigandBDBM50370754
Substrate/Competitorn/a
Meas. Tech.ChEMBL_382751 (CHEMBL854530)
Kd 153000±n/a nM
Citation Ciulli, AWilliams, GSmith, AGBlundell, TLAbell, C Probing hot spots at protein-ligand binding sites: a fragment-based approach using biophysical methods. J Med Chem49:4992-5000 (2006) 
 
2-dehydropantoate 2-reductase
Name:2-dehydropantoate 2-reductase
Type:PROTEIN
Mol. Mass.:33866.35
Organism:Escherichia coli (strain K12)
Description:ChEMBL_382751
Residue:303
BDBM50370754
NameBDBM50370754
Synonyms:CHEMBL252929
TypeSmall organic molecule
Emp. Form.C10H18N5O14P3
Mol. Mass.525.1963
SMILESNc1nc2N(CNc2c(=O)[nH]1)[C@@H]1O[C@H](COP(O)(=O)OP(O)(=O)OP(O)(O)=O)[C@@H](O)[C@H]1O