Reaction Details
Target2-dehydropantoate 2-reductase
LigandBDBM50192452
Substrate/Competitorn/a
Meas. Tech.ChEMBL_382751 (CHEMBL854530)
Kd 61000±n/a nM
Citation Ciulli, AWilliams, GSmith, AGBlundell, TLAbell, C Probing hot spots at protein-ligand binding sites: a fragment-based approach using biophysical methods. J Med Chem49:4992-5000 (2006) 
 
2-dehydropantoate 2-reductase
Name:2-dehydropantoate 2-reductase
Type:PROTEIN
Mol. Mass.:33866.35
Organism:Escherichia coli (strain K12)
Description:ChEMBL_382751
Residue:303
BDBM50192452
NameBDBM50192452
Synonyms:2'-monophosphoadenosine 5'-diphosphoribose
TypeSmall organic molecule
Emp. Form.C15H20N5O17P3
Mol. Mass.635.2661
SMILESNc1ncnc2n(cnc12)[C@@H]1O[C@H](COP([O-])(=O)OP([O-])(=O)OCC2OC(O)[C@H](O)[C@@H]2O)[C@@H](O)[C@H]1OP([O-])([O-])=O