Reaction Details
Target2-dehydropantoate 2-reductase
LigandBDBM18137
Substrate/Competitorn/a
Meas. Tech.ChEMBL_382751 (CHEMBL854530)
Kd>5000000±n/a nM
Citation Ciulli, AWilliams, GSmith, AGBlundell, TLAbell, C Probing hot spots at protein-ligand binding sites: a fragment-based approach using biophysical methods. J Med Chem49:4992-5000 (2006) 
 
2-dehydropantoate 2-reductase
Name:2-dehydropantoate 2-reductase
Type:PROTEIN
Mol. Mass.:33866.35
Organism:Escherichia coli (strain K12)
Description:ChEMBL_382751
Residue:303
BDBM18137
NameBDBM18137
Synonyms:AMP US11185100, TABLE 7.3 adenosine 5 -monophosphate | {[(2R,3S,4R,5R)-5-(6-amino-9H-purin-9-yl)-3,4-dihydroxyoxolan-2-yl]methoxy}phosphonic acid
TypeNucleoside or nucleotide
Emp. Form.C10H14N5O7P
Mol. Mass.347.2212
SMILESNc1ncnc2n(cnc12)[C@@H]1O[C@H](COP(O)(O)=O)[C@@H](O)[C@H]1O