Reaction Details
TargetMu-type opioid receptor
LigandBDBM50193540
Substrate/Competitorn/a
Meas. Tech.ChEMBL_386433 (CHEMBL854558)
Ki 0.490000±n/a nM
Citation Nieland, NPMoynihan, HACarrington, SBroadbear, JWoods, JHTraynor, JRHusbands, SMLewis, JW Structural determinants of opioid activity in derivatives of 14-aminomorphinones: effect of substitution in the aromatic ring of cinnamoylaminomorphinones and codeinones. J Med Chem49:5333-8 (2006) 
 
Mu-type opioid receptor
Name:Mu-type opioid receptor
Type:G Protein-Coupled Receptor (GPCR)
Mol. Mass.:44789.51
Organism:Homo sapiens (Human)
Description:P35372
Residue:400
BDBM50193540
NameBDBM50193540
Synonyms:14beta-(4'-methylcinnamoylamino)-7,8-dihydrocodeinone
TypeSmall organic molecule
Emp. Form.C28H30N2O4
Mol. Mass.458.5488
SMILESCOc1ccc2CC3N(C)CC[C@@]45[C@@H](Oc1c24)C(=O)CC[C@@]35NC(=O)\C=C\c1ccc(C)cc1