Reaction Details
TargetDelta-type opioid receptor
LigandBDBM50193538
Substrate/Competitorn/a
Meas. Tech.ChEMBL_386441 (CHEMBL864220)
EC50 5±n/a nM
Citation Nieland, NPMoynihan, HACarrington, SBroadbear, JWoods, JHTraynor, JRHusbands, SMLewis, JW Structural determinants of opioid activity in derivatives of 14-aminomorphinones: effect of substitution in the aromatic ring of cinnamoylaminomorphinones and codeinones. J Med Chem49:5333-8 (2006) 
 
Delta-type opioid receptor
Name:Delta-type opioid receptor
Type:G Protein-Coupled Receptor (GPCR)
Mol. Mass.:40382.98
Organism:Homo sapiens (Human)
Description:Competition binding assays were carried out using membrane preparations from transfected HN9.10 cells that constitutively expressed the delta opioid receptor.
Residue:372
BDBM50193538
NameBDBM50193538
Synonyms:14beta-(4'-chlorocinnamoylamino)-7,8-dihydrocodeinone
TypeSmall organic molecule
Emp. Form.C27H27ClN2O4
Mol. Mass.478.967
SMILESCOc1ccc2CC3N(C)CC[C@@]45[C@@H](Oc1c24)C(=O)CC[C@@]35NC(=O)\C=C\c1ccc(Cl)cc1