Reaction Details
TargetDelta-type opioid receptor
LigandBDBM50193545
Substrate/Competitorn/a
Meas. Tech.ChEMBL_386435 (CHEMBL863623)
Ki 1.3±n/a nM
Citation Nieland, NPMoynihan, HACarrington, SBroadbear, JWoods, JHTraynor, JRHusbands, SMLewis, JW Structural determinants of opioid activity in derivatives of 14-aminomorphinones: effect of substitution in the aromatic ring of cinnamoylaminomorphinones and codeinones. J Med Chem49:5333-8 (2006) 
 
Delta-type opioid receptor
Name:Delta-type opioid receptor
Type:G Protein-Coupled Receptor (GPCR)
Mol. Mass.:40382.98
Organism:Homo sapiens (Human)
Description:Competition binding assays were carried out using membrane preparations from transfected HN9.10 cells that constitutively expressed the delta opioid receptor.
Residue:372
BDBM50193545
NameBDBM50193545
Synonyms:N-cyclopropylmethyl-14beta-(2'-methylcinnamoylamino)-7,8-dihydronormorphinone
TypeSmall organic molecule
Emp. Form.C30H32N2O4
Mol. Mass.484.5861
SMILESCc1ccccc1\C=C\C(=O)N[C@]12CCC(=O)[C@@H]3Oc4c5c(CC1N(CC1CC1)CC[C@@]235)ccc4O