Reaction Details
TargetDelta-type opioid receptor
LigandBDBM50027230
Substrate/Competitorn/a
Meas. Tech.ChEMBL_386435 (CHEMBL863623)
Ki 0.080000±n/a nM
Citation Nieland, NPMoynihan, HACarrington, SBroadbear, JWoods, JHTraynor, JRHusbands, SMLewis, JW Structural determinants of opioid activity in derivatives of 14-aminomorphinones: effect of substitution in the aromatic ring of cinnamoylaminomorphinones and codeinones. J Med Chem49:5333-8 (2006) 
 
Delta-type opioid receptor
Name:Delta-type opioid receptor
Type:G Protein-Coupled Receptor (GPCR)
Mol. Mass.:40382.98
Organism:Homo sapiens (Human)
Description:Competition binding assays were carried out using membrane preparations from transfected HN9.10 cells that constitutively expressed the delta opioid receptor.
Residue:372
BDBM50027230
NameBDBM50027230
Synonyms:CHEMBL2113666
TypeSmall organic molecule
Emp. Form.C26H25ClN2O3
Mol. Mass.448.941
SMILES[H][C@@]12Oc3cccc4C[C@@]5([H])N(C)CC[C@@]1(c34)[C@]5(CCC2=O)NC(=O)\C=C\c1ccccc1Cl