Reaction Details
TargetDelta-type opioid receptor
LigandBDBM50193542
Substrate/Competitorn/a
Meas. Tech.ChEMBL_386435 (CHEMBL863623)
Ki 4±n/a nM
Citation Nieland, NPMoynihan, HACarrington, SBroadbear, JWoods, JHTraynor, JRHusbands, SMLewis, JW Structural determinants of opioid activity in derivatives of 14-aminomorphinones: effect of substitution in the aromatic ring of cinnamoylaminomorphinones and codeinones. J Med Chem49:5333-8 (2006) 
 
Delta-type opioid receptor
Name:Delta-type opioid receptor
Type:G Protein-Coupled Receptor (GPCR)
Mol. Mass.:40382.98
Organism:Homo sapiens (Human)
Description:Competition binding assays were carried out using membrane preparations from transfected HN9.10 cells that constitutively expressed the delta opioid receptor.
Residue:372
BDBM50193542
NameBDBM50193542
Synonyms:17-methyl-4'-methyldihydromorphinone
TypeSmall organic molecule
Emp. Form.C27H28N2O4
Mol. Mass.444.5222
SMILESCN1CC[C@@]23[C@H]4Oc5c2c(CC1[C@@]3(CCC4=O)NC(=O)\C=C\c1ccc(C)cc1)ccc5O