Reaction Details
TargetMu-type opioid receptor
LigandBDBM50193536
Substrate/Competitorn/a
Meas. Tech.ChEMBL_386439 (CHEMBL864218)
EC50 2.6±n/a nM
Citation Nieland, NPMoynihan, HACarrington, SBroadbear, JWoods, JHTraynor, JRHusbands, SMLewis, JW Structural determinants of opioid activity in derivatives of 14-aminomorphinones: effect of substitution in the aromatic ring of cinnamoylaminomorphinones and codeinones. J Med Chem49:5333-8 (2006) 
 
Mu-type opioid receptor
Name:Mu-type opioid receptor
Type:G Protein-Coupled Receptor (GPCR)
Mol. Mass.:44789.51
Organism:Homo sapiens (Human)
Description:P35372
Residue:400
BDBM50193536
NameBDBM50193536
Synonyms:N-cyclopropylmethyl-14beta-(2'-methylcinnamoylamino)-7,8-dihydronorcodeinone
TypeSmall organic molecule
Emp. Form.C31H34N2O4
Mol. Mass.498.6127
SMILESCOc1ccc2CC3N(CC4CC4)CC[C@@]45[C@@H](Oc1c24)C(=O)CC[C@@]35NC(=O)\C=C\c1ccccc1C