Reaction Details
TargetMu-type opioid receptor
LigandBDBM50195656
Substrate/Competitorn/a
Meas. Tech.ChEMBL_386439 (CHEMBL864218)
Ki 3±n/a nM
Citation Nieland, NPMoynihan, HACarrington, SBroadbear, JWoods, JHTraynor, JRHusbands, SMLewis, JW Structural determinants of opioid activity in derivatives of 14-aminomorphinones: effect of substitution in the aromatic ring of cinnamoylaminomorphinones and codeinones. J Med Chem49:5333-8 (2006) 
 
Mu-type opioid receptor
Name:Mu-type opioid receptor
Type:G Protein-Coupled Receptor (GPCR)
Mol. Mass.:44789.51
Organism:Homo sapiens (Human)
Description:P35372
Residue:400
BDBM50195656
NameBDBM50195656
Synonyms:14beta-4'-Chlorocinnamoylaminodihydronormorphinone C-CAM clocinnamox
TypeSmall organic molecule
Emp. Form.C29H29ClN2O4
Mol. Mass.505.005
SMILESOc1ccc2C[C@H]3N(CC4CC4)CC[C@@]45[C@@H](Oc1c24)C(=O)CC[C@@]35NC(=O)\C=C\c1ccc(Cl)cc1