Reaction Details
TargetSodium-dependent serotonin transporter
LigandBDBM50124566
Substrate/Competitorn/a
Meas. Tech.ChEMBL_390292 (CHEMBL869834)
IC50 590±n/a nM
Citation Jonathan Fray, MBish, GBrown, ADFish, PVStobie, AWakenhut, FWhitlock, GA N-(1,2-diphenylethyl)piperazines: a new class of dual serotonin/noradrenaline reuptake inhibitor. Bioorg Med Chem Lett16:4345-8 (2006) 
 
Sodium-dependent serotonin transporter
Name:Sodium-dependent serotonin transporter
Type:Multi-pass membrane protein
Mol. Mass.:70322.51
Organism:Homo sapiens (Human)
Description:P31645
Residue:630
BDBM50124566
NameBDBM50124566
Synonyms:(R)-2-((R)-(2-ethoxyphenoxy)(phenyl)methyl)morpholine 2-((2-ethoxyphenoxy)(phenyl)methyl)morpholine 2-[2-ethoxyphenoxy(phenyl)methyl]-1,4-oxazinane REBOXETINE | rac-syn-2-((2-ethoxyphenoxy)(phenyl)methyl)morpholine
TypeSmall organic molecule
Emp. Form.C19H23NO3
Mol. Mass.313.3908
SMILESCCOc1ccccc1OC(C1CNCCO1)c1ccccc1