Reaction Details
TargetRNA-directed RNA polymerase
LigandBDBM50193054
Substrate/Competitorn/a
Meas. Tech.ChEMBL_391864 (CHEMBL862448)
IC50 16±n/a nM
Citation Beaulieu, PLGillard, JBykowski, DBrochu, CDansereau, NDuceppe, JSHaché, BJakalian, ALagacé, LLaPlante, SMcKercher, GMoreau, EPerreault, SStammers, TThauvette, LWarrington, JKukolj, G Improved replicon cellular activity of non-nucleoside allosteric inhibitors of HCV NS5B polymerase: from benzimidazole to indole scaffolds. Bioorg Med Chem Lett16:4987-93 (2006) 
 
RNA-directed RNA polymerase
Name:RNA-directed RNA polymerase
Type:Protein
Mol. Mass.:25173.95
Organism:Hepatitis C virus
Description:Q8JXU8
Residue:229
BDBM50193054
NameBDBM50193054
Synonyms:3-cyclohexyl-2-(furan-3-yl)-1-methyl-1H-indole-6-carboxylic acid | CHEMBL386508
TypeSmall organic molecule
Emp. Form.C20H21NO3
Mol. Mass.323.3856
SMILESCn1c(-c2ccoc2)c(C2CCCCC2)c2ccc(cc12)C(O)=O