Reaction Details
TargetKappa-type opioid receptor
LigandBDBM50097579
Substrate/Competitorn/a
Meas. Tech.ChEMBL_392923 (CHEMBL870417)
Ki 0.060000±n/a nM
Citation Wentland, MPVanAlstine, MKucejko, RLou, RCohen, DJParkhill, ALBidlack, JM Redefining the structure-activity relationships of 2,6-methano-3-benzazocines. 4. Opioid receptor binding properties of 8-[N-(4'-phenyl)-phenethyl)carboxamido] analogues of cyclazocine and ethylketocycalzocine. J Med Chem49:5635-9 (2006) 
 
Kappa-type opioid receptor
Name:Kappa-type opioid receptor
Type:G Protein-Coupled Receptor (GPCR)
Mol. Mass.:42648.76
Organism:Homo sapiens (Human)
Description:P41145
Residue:380
BDBM50097579
NameBDBM50097579
Synonyms:(6S,11R)-3-Cyclopropylmethyl-6,11-dimethyl-1,2,3,4,5,6-hexahydro-2,6-methano-benzo[d]azocine-8-carboxylic acid amide 8-carboxamidocyclazocine US9656961, Example 00157
TypeSmall organic molecule
Emp. Form.C19H26N2O
Mol. Mass.298.4225
SMILESC[C@H]1C2Cc3ccc(cc3[C@@]1(C)CCN2CC1CC1)C(N)=O