Reaction Details
TargetMu-type opioid receptor
LigandBDBM50194268
Substrate/Competitorn/a
Meas. Tech.ChEMBL_392924 (CHEMBL870418)
Ki 6.7±n/a nM
Citation Wentland, MPVanAlstine, MKucejko, RLou, RCohen, DJParkhill, ALBidlack, JM Redefining the structure-activity relationships of 2,6-methano-3-benzazocines. 4. Opioid receptor binding properties of 8-[N-(4'-phenyl)-phenethyl)carboxamido] analogues of cyclazocine and ethylketocycalzocine. J Med Chem49:5635-9 (2006) 
 
Mu-type opioid receptor
Name:Mu-type opioid receptor
Type:G Protein-Coupled Receptor (GPCR)
Mol. Mass.:44789.51
Organism:Homo sapiens (Human)
Description:P35372
Residue:400
BDBM50194268
NameBDBM50194268
Synonyms:(+/-)-3-(cyclopropylmethyl)-1,2,3,4,5,6-hexahydro-cis-6,11-dimethyl-N-(2-[1,1'-biphenyl]-4-ylethyl)-N-methyl-2,6-methano-3-benzazocine-8-carboxamide | CHEMBL215594
TypeSmall organic molecule
Emp. Form.C34H40N2O
Mol. Mass.492.6942
SMILESC[C@H]1C2Cc3ccc(cc3[C@@]1(C)CCN2CC1CC1)C(=O)N(C)CCc1ccc(cc1)-c1ccccc1