Reaction Details
TargetMu-type opioid receptor
LigandBDBM50194272
Substrate/Competitorn/a
Meas. Tech.ChEMBL_392924 (CHEMBL870418)
Ki 3.1±n/a nM
Citation Wentland, MPVanAlstine, MKucejko, RLou, RCohen, DJParkhill, ALBidlack, JM Redefining the structure-activity relationships of 2,6-methano-3-benzazocines. 4. Opioid receptor binding properties of 8-[N-(4'-phenyl)-phenethyl)carboxamido] analogues of cyclazocine and ethylketocycalzocine. J Med Chem49:5635-9 (2006) 
 
Mu-type opioid receptor
Name:Mu-type opioid receptor
Type:G Protein-Coupled Receptor (GPCR)
Mol. Mass.:44789.51
Organism:Homo sapiens (Human)
Description:P35372
Residue:400
BDBM50194272
NameBDBM50194272
Synonyms:(+/-)-3-(cyclopropylmethyl)-6-ethyl-1,2,3,4,5,6-hexaahydro-cis-11-methyl-N-(2-[1,1'-biphenyl]-4-ylethyl)-1-oxo-2,6-methano-3-benzazocine-8-carboxamide | CHEMBL214104
TypeSmall organic molecule
Emp. Form.C34H38N2O2
Mol. Mass.506.6777
SMILESCC[C@]12CCN(CC3CC3)C([C@@H]1C)C(=O)c1ccc(cc21)C(=O)NCCc1ccc(cc1)-c1ccccc1