Reaction Details
TargetKappa-type opioid receptor
LigandBDBM50097586
Substrate/Competitorn/a
Meas. Tech.ChEMBL_392923 (CHEMBL870417)
Ki 0.470000±n/a nM
Citation Wentland, MPVanAlstine, MKucejko, RLou, RCohen, DJParkhill, ALBidlack, JM Redefining the structure-activity relationships of 2,6-methano-3-benzazocines. 4. Opioid receptor binding properties of 8-[N-(4'-phenyl)-phenethyl)carboxamido] analogues of cyclazocine and ethylketocycalzocine. J Med Chem49:5635-9 (2006) 
 
Kappa-type opioid receptor
Name:Kappa-type opioid receptor
Type:G Protein-Coupled Receptor (GPCR)
Mol. Mass.:42648.76
Organism:Homo sapiens (Human)
Description:P41145
Residue:380
BDBM50097586
NameBDBM50097586
Synonyms:(6S,11R)-3-Cyclopropylmethyl-6-ethyl-11-methyl-1-oxo-1,2,3,4,5,6-hexahydro-2,6-methano-benzo[d]azocine-8-carboxylic acid amide CHEMBL60869
TypeSmall organic molecule
Emp. Form.C20H26N2O2
Mol. Mass.326.4326
SMILESCC[C@]12CCN(CC3CC3)C([C@@H]1C)C(=O)c1ccc(cc21)C(N)=O