Reaction Details
Target17-beta-hydroxysteroid dehydrogenase type 2
LigandBDBM50190017
Substrate/Competitorn/a
Meas. Tech.ChEMBL_398762 (CHEMBL908034)
IC50 10±n/a nM
Citation Wood, JBagi, CMAkuche, CBacchiocchi, ABaryza, JBlue, MLBrennan, CCampbell, AMChoi, SCook, JHConrad, PDixon, BREhrlich, PPGane, TGunn, DJoe, TJohnson, JSJordan, JKramss, RLiu, PLevy, JLowe, DBMcAlexander, INatero, RRedman, AMScott, WJTown, CWang, MWang, YZhang, Z 4,5-Disubstituted cis-pyrrolidinones as inhibitors of type II 17beta-hydroxysteroid dehydrogenase. Part 3. Identification of lead candidate. Bioorg Med Chem Lett16:4965-8 (2006) 
 
17-beta-hydroxysteroid dehydrogenase type 2
Name:17-beta-hydroxysteroid dehydrogenase type 2
Type:Oxidoreductase; single-pass type II membrane protein
Mol. Mass.:42795.29
Organism:Homo sapiens (Human)
Description:Enzyme was partially purified from human placenta.
Residue:387
BDBM50190017
NameBDBM50190017
Synonyms:(4R,5R)-4-(2-fluorophenyl)-5-((S)-hydroxy(5-phenylthiophen-2-yl)methyl)-1-methylpyrrolidin-2-one | CHEMBL383970
TypeSmall organic molecule
Emp. Form.C22H20FNO2S
Mol. Mass.381.463
SMILESCN1[C@@H]([C@H](O)c2ccc(s2)-c2ccccc2)[C@H](CC1=O)c1ccccc1F