Reaction Details
Target17-beta-hydroxysteroid dehydrogenase type 2
LigandBDBM50190031
Substrate/Competitorn/a
Meas. Tech.ChEMBL_398762 (CHEMBL908034)
IC50 70±n/a nM
Citation Wood, JBagi, CMAkuche, CBacchiocchi, ABaryza, JBlue, MLBrennan, CCampbell, AMChoi, SCook, JHConrad, PDixon, BREhrlich, PPGane, TGunn, DJoe, TJohnson, JSJordan, JKramss, RLiu, PLevy, JLowe, DBMcAlexander, INatero, RRedman, AMScott, WJTown, CWang, MWang, YZhang, Z 4,5-Disubstituted cis-pyrrolidinones as inhibitors of type II 17beta-hydroxysteroid dehydrogenase. Part 3. Identification of lead candidate. Bioorg Med Chem Lett16:4965-8 (2006) 
 
17-beta-hydroxysteroid dehydrogenase type 2
Name:17-beta-hydroxysteroid dehydrogenase type 2
Type:Oxidoreductase; single-pass type II membrane protein
Mol. Mass.:42795.29
Organism:Homo sapiens (Human)
Description:Enzyme was partially purified from human placenta.
Residue:387
BDBM50190031
NameBDBM50190031
Synonyms:(4R,5R)-5-((S)-hydroxy(5-(morpholinosulfonyl)thiophen-2-yl)methyl)-1-methyl-4-phenylpyrrolidin-2-one | CHEMBL214282
TypeSmall organic molecule
Emp. Form.C20H24N2O5S2
Mol. Mass.436.545
SMILESCN1[C@@H]([C@H](O)c2ccc(s2)S(=O)(=O)N2CCOCC2)[C@H](CC1=O)c1ccccc1