Reaction Details
Target17-beta-hydroxysteroid dehydrogenase type 2
LigandBDBM50190030
Substrate/Competitorn/a
Meas. Tech.ChEMBL_398762 (CHEMBL908034)
IC50 40±n/a nM
Citation Wood, JBagi, CMAkuche, CBacchiocchi, ABaryza, JBlue, MLBrennan, CCampbell, AMChoi, SCook, JHConrad, PDixon, BREhrlich, PPGane, TGunn, DJoe, TJohnson, JSJordan, JKramss, RLiu, PLevy, JLowe, DBMcAlexander, INatero, RRedman, AMScott, WJTown, CWang, MWang, YZhang, Z 4,5-Disubstituted cis-pyrrolidinones as inhibitors of type II 17beta-hydroxysteroid dehydrogenase. Part 3. Identification of lead candidate. Bioorg Med Chem Lett16:4965-8 (2006) 
 
17-beta-hydroxysteroid dehydrogenase type 2
Name:17-beta-hydroxysteroid dehydrogenase type 2
Type:Oxidoreductase; single-pass type II membrane protein
Mol. Mass.:42795.29
Organism:Homo sapiens (Human)
Description:Enzyme was partially purified from human placenta.
Residue:387
BDBM50190030
NameBDBM50190030
Synonyms:(4R,5R)-5-((S)-hydroxy(5-(phenylsulfonyl)thiophen-2-yl)methyl)-4-(2-methoxyphenyl)-1-methylpyrrolidin-2-one | CHEMBL215309
TypeSmall organic molecule
Emp. Form.C23H23NO5S2
Mol. Mass.457.562
SMILESCOc1ccccc1[C@H]1CC(=O)N(C)[C@H]1[C@H](O)c1ccc(s1)S(=O)(=O)c1ccccc1