Reaction Details
Target17-beta-hydroxysteroid dehydrogenase type 2
LigandBDBM50190035
Substrate/Competitorn/a
Meas. Tech.ChEMBL_398762 (CHEMBL908034)
IC50 120±n/a nM
Citation Wood, JBagi, CMAkuche, CBacchiocchi, ABaryza, JBlue, MLBrennan, CCampbell, AMChoi, SCook, JHConrad, PDixon, BREhrlich, PPGane, TGunn, DJoe, TJohnson, JSJordan, JKramss, RLiu, PLevy, JLowe, DBMcAlexander, INatero, RRedman, AMScott, WJTown, CWang, MWang, YZhang, Z 4,5-Disubstituted cis-pyrrolidinones as inhibitors of type II 17beta-hydroxysteroid dehydrogenase. Part 3. Identification of lead candidate. Bioorg Med Chem Lett16:4965-8 (2006) 
 
17-beta-hydroxysteroid dehydrogenase type 2
Name:17-beta-hydroxysteroid dehydrogenase type 2
Type:Oxidoreductase; single-pass type II membrane protein
Mol. Mass.:42795.29
Organism:Homo sapiens (Human)
Description:Enzyme was partially purified from human placenta.
Residue:387
BDBM50190035
NameBDBM50190035
Synonyms:(4R,5R)-5-((S)-(5-(4-fluorophenyl)thiophen-2-yl)(hydroxy)methyl)-4-(2-methoxyphenyl)-1-methylpyrrolidin-2-one | CHEMBL215923
TypeSmall organic molecule
Emp. Form.C23H22FNO3S
Mol. Mass.411.489
SMILESCOc1ccccc1[C@H]1CC(=O)N(C)[C@H]1[C@H](O)c1ccc(s1)-c1ccc(F)cc1