Reaction Details
TargetCaspase-1
LigandBDBM50189360
Substrate/Competitorn/a
Meas. Tech.ChEMBL_399982 (CHEMBL910313)
IC50 3.6±n/a nM
Citation Ellis, CDOppong, KALaufersweiler, MCO'Neil, SVSoper, DLWang, YWos, JAFancher, ANLu, WSuchanek, MKWang, RLDe, BDemuth, TP Synthesis and evaluation of thiazepines as interleukin-1beta converting enzyme (ICE) inhibitors. Bioorg Med Chem Lett16:4728-32 (2006) 
 
Caspase-1
Name:Caspase-1
Type:Enzyme
Mol. Mass.:45154.13
Organism:Homo sapiens (Human)
Description:P29466
Residue:404
BDBM50189360
NameBDBM50189360
Synonyms:(1S,10S)-9-[(Isoquinoline-1-carbonyl)-amino]-6,10-dioxo-octahydro-pyridazino[1,2-a][1,2]diazepine-1-carboxylic acid ((S)-2-ethoxy-5-oxo-tetrahydro-furan-3-yl)-amide | (1S,9S)-N-((2R,3S)-2-ethoxy-5-oxo-tetrahydrofuran-3-yl)-9-(isoquinoline-1-carboxamido)-6,10-dioxo-octahydro-1H-pyridazino[1,2-a][1,2]diazepine-1-carboxamide
TypeSmall organic molecule
Emp. Form.C26H29N5O7
Mol. Mass.523.5378
SMILESCCO[C@@H]1OC(=O)C[C@@H]1NC(=O)[C@@H]1CCCN2N1C(=O)[C@H](CCC2=O)NC(=O)c1nccc2ccccc12