Reaction Details
TargetCyclin-dependent kinase 6
LigandBDBM6619
Substrate/Competitorn/a
Meas. Tech.ChEMBL_404511 (CHEMBL910894)
IC50 71±n/a nM
Citation Kawanishi, NSugimoto, TShibata, JNakamura, KMasutani, KIkuta, MHirai, H Structure-based drug design of a highly potent CDK1,2,4,6 inhibitor with novel macrocyclic quinoxalin-2-one structure. Bioorg Med Chem Lett16:5122-6 (2006) 
 
Cyclin-dependent kinase 6
Name:Cyclin-dependent kinase 6
Type:Enzyme Subunit
Mol. Mass.:36937.42
Organism:Homo sapiens (Human)
Description:Q00534
Residue:326
BDBM6619
NameBDBM6619
Synonyms:3-[(9bR)-5-oxo-1H,2H,3H,5H,9bH-benzo[a]pyrrolizin-9-yl]-1-pyridin-2-ylurea N -(pyrrolidino[2,1-b]isoindolin-4-on-8-yl)-N-(pyridin-2yl)urea diarylurea deriv. 1
TypeSmall organic molecule
Emp. Form.C17H16N4O2
Mol. Mass.308.3345
SMILESO=C(Nc1ccccn1)Nc1cccc2C(=O)N3CCC[C@@H]3c12