Reaction Details
TargetCathepsin D
LigandBDBM50189976
Substrate/Competitorn/a
Meas. Tech.ChEMBL_405298 (CHEMBL869858)
IC50 4710±n/a nM
Citation Srivastava, VSaxena, HOShanker, KKumar, JKLuqman, SGupta, MMKhanuja, SPNegi, AS Synthesis of gallic acid based naphthophenone fatty acid amides as cathepsin D inhibitors. Bioorg Med Chem Lett16:4603-8 (2006) 
 
Cathepsin D
Name:Cathepsin D
Type:Enzyme
Mol. Mass.:44551.72
Organism:Homo sapiens (Human)
Description:Human proCathepsin D (SwissProt accession number P07339) was expressed in Sf9 cells, purified, and autoactivated.
Residue:412
BDBM50189976
NameBDBM50189976
Synonyms:CHEMBL212492 | N-(4-methoxyphenyl)-4-(1-(3,4,5-trimethoxybenzoyl)naphthalen-2-yloxy)but-2-enamide
TypeSmall organic molecule
Emp. Form.C31H29NO7
Mol. Mass.527.5645
SMILESCOc1ccc(NC(=O)\C=C\COc2ccc3ccccc3c2C(=O)c2cc(OC)c(OC)c(OC)c2)cc1