Reaction Details
TargetCathepsin D
LigandBDBM50189980
Substrate/Competitorn/a
Meas. Tech.ChEMBL_405298 (CHEMBL869858)
IC50 8900±n/a nM
Citation Srivastava, VSaxena, HOShanker, KKumar, JKLuqman, SGupta, MMKhanuja, SPNegi, AS Synthesis of gallic acid based naphthophenone fatty acid amides as cathepsin D inhibitors. Bioorg Med Chem Lett16:4603-8 (2006) 
 
Cathepsin D
Name:Cathepsin D
Type:Enzyme
Mol. Mass.:44551.72
Organism:Homo sapiens (Human)
Description:Human proCathepsin D (SwissProt accession number P07339) was expressed in Sf9 cells, purified, and autoactivated.
Residue:412
BDBM50189980
NameBDBM50189980
Synonyms:CHEMBL213373 | N-octyl-2-(1-(3,4,5-trimethoxybenzoyl)naphthalen-2-yloxy)acetamide
TypeSmall organic molecule
Emp. Form.C30H37NO6
Mol. Mass.507.6179
SMILESCCCCCCCCNC(=O)COc1ccc2ccccc2c1C(=O)c1cc(OC)c(OC)c(OC)c1