Reaction Details
TargetCathepsin D
LigandBDBM50189981
Substrate/Competitorn/a
Meas. Tech.ChEMBL_405298 (CHEMBL869858)
IC50 60±n/a nM
Citation Srivastava, VSaxena, HOShanker, KKumar, JKLuqman, SGupta, MMKhanuja, SPNegi, AS Synthesis of gallic acid based naphthophenone fatty acid amides as cathepsin D inhibitors. Bioorg Med Chem Lett16:4603-8 (2006) 
 
Cathepsin D
Name:Cathepsin D
Type:Enzyme
Mol. Mass.:44551.72
Organism:Homo sapiens (Human)
Description:Human proCathepsin D (SwissProt accession number P07339) was expressed in Sf9 cells, purified, and autoactivated.
Residue:412
BDBM50189981
NameBDBM50189981
Synonyms:2-[1-(3,4,5-trimethoxybenzoyl)naphthalen-2-yloxy]ethanoic acid | CHEMBL212787
TypeSmall organic molecule
Emp. Form.C22H20O7
Mol. Mass.396.39
SMILESCOc1cc(cc(OC)c1OC)C(=O)c1c(OCC(O)=O)ccc2ccccc12