Reaction Details
TargetAcetylcholinesterase
LigandBDBM50200340
Substrate/Competitorn/a
Meas. Tech.ChEMBL_410404 (CHEMBL911226)
Ki 0.033±n/a nM
Citation Camps, PGómez, EMuñoz-Torrero, DBadia, AClos, MVCurutchet, CMuñoz-Muriedas, JLuque, FJ Binding of 13-amidohuprines to acetylcholinesterase: exploring the ligand-induced conformational change of the gly117-gly118 peptide bond in the oxyanion hole. J Med Chem49:6833-40 (2006) 
 
Acetylcholinesterase
Name:Acetylcholinesterase
Type:Enzyme
Mol. Mass.:67792.70
Organism:Homo sapiens (Human)
Description:P22303
Residue:614
BDBM50200340
NameBDBM50200340
Synonyms:(+/-)-huprine Y-HCl CHEMBL536047
TypeSmall organic molecule
Emp. Form.C17H17ClN2
Mol. Mass.284.783
SMILESCC1=CC2CC(C1)c1c(C2)nc2cc(Cl)ccc2c1N