Reaction Details
TargetMotilin receptor
LigandBDBM50199353
Substrate/Competitorn/a
Meas. Tech.ChEMBL_411464 (CHEMBL853861)
Ki 62±n/a nM
Citation Marsault, EHoveyda, HRPeterson, MLSaint-Louis, CLandry, AVézina, MOuellet, LWang, ZRamaseshan, MBeaubien, SBenakli, KBeauchemin, SDéziel, RPeeters, TFraser, GL Discovery of a new class of macrocyclic antagonists to the human motilin receptor. J Med Chem49:7190-7 (2006) 
 
Motilin receptor
Name:Motilin receptor
Type:PROTEIN
Mol. Mass.:45365.95
Organism:Homo sapiens (Human)
Description:ChEMBL_122664
Residue:412
BDBM50199353
NameBDBM50199353
Synonyms:(9R,12R,15S)-9-(4-hydroxy-benzyl)-15-isobutyl-12-isopropyl-6,7,8,9,11,12,14,15,17,18-decahydro-5-oxa-8,11,14,17-tetraaza-benzocyclooctadecene-10,13,16-trione | CHEMBL215946
TypeSmall organic molecule
Emp. Form.C31H42N4O5
Mol. Mass.550.689
SMILESCC(C)C[C@@H]1NC(=O)[C@H](NC(=O)[C@@H](Cc2ccc(O)cc2)NCCOc2ccccc2\C=C\CNC1=O)C(C)C