Reaction Details
TargetRNA-directed RNA polymerase
LigandBDBM50199054
Substrate/Competitorn/a
Meas. Tech.ChEMBL_411597 (CHEMBL907248)
IC50 47±n/a nM
Citation Ikegashira, KOka, THirashima, SNoji, SYamanaka, HHara, YAdachi, TTsuruha, JDoi, SHase, YNoguchi, TAndo, IOgura, NIkeda, SHashimoto, H Discovery of conformationally constrained tetracyclic compounds as potent hepatitis C virus NS5B RNA polymerase inhibitors. J Med Chem49:6950-3 (2006) 
 
RNA-directed RNA polymerase
Name:RNA-directed RNA polymerase
Type:Protein
Mol. Mass.:25173.95
Organism:Hepatitis C virus
Description:Q8JXU8
Residue:229
BDBM50199054
NameBDBM50199054
Synonyms:14-cyclohexyl-7,8-dihydro-6H-indole[1,2e][1,5]benzoxazocine-11-carboxylic acid | CHEMBL217259
TypeSmall organic molecule
Emp. Form.C25H26O3
Mol. Mass.374.4721
SMILESOC(=O)c1ccc2C(C3CCCCC3)=C3C(CCCOc4ccccc34)c2c1