Reaction Details
TargetP2Y purinoceptor 2
LigandBDBM50199184
Substrate/Competitorn/a
Meas. Tech.ChEMBL_413294 (CHEMBL907213)
EC50>1000±n/a nM
Citation El-Tayeb, AQi, AMüller, CE Synthesis and structure-activity relationships of uracil nucleotide derivatives and analogues as agonists at human P2Y2, P2Y4, and P2Y6 receptors. J Med Chem49:7076-87 (2006) 
 
P2Y purinoceptor 2
Name:P2Y purinoceptor 2
Type:PROTEIN
Mol. Mass.:42299.21
Organism:Homo sapiens (Human)
Description:ChEMBL_1455361
Residue:377
BDBM50199184
NameBDBM50199184
Synonyms:5-BROMO-URIDINE-5'-MONOPHOSPHATE CHEMBL214830
TypeSmall organic molecule
Emp. Form.C9H12BrN2O9P
Mol. Mass.403.077
SMILESO[C@H]1[C@@H](O)[C@@H](O[C@@H]1COP(O)(O)=O)n1cc(Br)c(=O)[nH]c1=O