Reaction Details
TargetCannabinoid receptor 2
LigandBDBM50195511
Substrate/Competitorn/a
Meas. Tech.ChEMBL_414849 (CHEMBL855031)
Ki 8.4±n/a nM
Citation Manera, CBenetti, VCastelli, MPCavallini, TLazzarotti, SPibiri, FSaccomanni, GTuccinardi, TVannacci, AMartinelli, AFerrarini, PL Design, synthesis, and biological evaluation of new 1,8-naphthyridin-4(1H)-on-3-carboxamide and quinolin-4(1H)-on-3-carboxamide derivatives as CB2 selective agonists. J Med Chem49:5947-57 (2006) 
 
Cannabinoid receptor 2
Name:Cannabinoid receptor 2
Type:Enzyme Catalytic Domain
Mol. Mass.:38220.43
Organism:MOUSE
Description:P47936
Residue:347
BDBM50195511
NameBDBM50195511
Synonyms:CHEMBL217549 | N-(4'-methylcyclohexyl)-1-(o-fluorobenzyl)-7-methyl-1,8-naphthyridin-4(1H)-on-3-carboxamide
TypeSmall organic molecule
Emp. Form.C24H26FN3O2
Mol. Mass.407.4805
SMILESCC1CCC(CC1)NC(=O)c1cn(Cc2ccccc2F)c2nc(C)ccc2c1=O