Reaction Details
TargetCannabinoid receptor 1
LigandBDBM50072769
Substrate/Competitorn/a
Meas. Tech.ChEMBL_414848 (CHEMBL855029)
Ki 3.9±n/a nM
Citation Manera, CBenetti, VCastelli, MPCavallini, TLazzarotti, SPibiri, FSaccomanni, GTuccinardi, TVannacci, AMartinelli, AFerrarini, PL Design, synthesis, and biological evaluation of new 1,8-naphthyridin-4(1H)-on-3-carboxamide and quinolin-4(1H)-on-3-carboxamide derivatives as CB2 selective agonists. J Med Chem49:5947-57 (2006) 
 
Cannabinoid receptor 1
Name:Cannabinoid receptor 1
Type:Enzyme
Mol. Mass.:52842.52
Organism:Mus musculus (Mouse)
Description:P47746
Residue:473
BDBM50072769
NameBDBM50072769
Synonyms:(5Z,8Z,11Z,14Z)-Icosa-5,8,11,14-tetraenoic acid (2-chloro-ethyl)-amide CHEMBL151167 | N-(2-chloroethyl)icosa-5,8,11,14-tetraenamide
TypeSmall organic molecule
Emp. Form.C22H36ClNO
Mol. Mass.365.98
SMILESCCCCC\C=C/C\C=C/C\C=C/C\C=C/CCCC(=O)NCCCl