Reaction Details
TargetCannabinoid receptor 2
LigandBDBM50195519
Substrate/Competitorn/a
Meas. Tech.ChEMBL_414849 (CHEMBL855031)
Ki 10±n/a nM
Citation Manera, CBenetti, VCastelli, MPCavallini, TLazzarotti, SPibiri, FSaccomanni, GTuccinardi, TVannacci, AMartinelli, AFerrarini, PL Design, synthesis, and biological evaluation of new 1,8-naphthyridin-4(1H)-on-3-carboxamide and quinolin-4(1H)-on-3-carboxamide derivatives as CB2 selective agonists. J Med Chem49:5947-57 (2006) 
 
Cannabinoid receptor 2
Name:Cannabinoid receptor 2
Type:Enzyme Catalytic Domain
Mol. Mass.:38220.43
Organism:MOUSE
Description:P47936
Residue:347
BDBM50195519
NameBDBM50195519
Synonyms:CHEMBL384595 | N-cyclohexyl-7-methyl-1-benzyl-1,8-naphthyridin-4(1H)-on-3-carboxamide
TypeSmall organic molecule
Emp. Form.C23H25N3O2
Mol. Mass.375.4635
SMILESCc1ccc2c(n1)n(Cc1ccccc1)cc(C(=O)NC1CCCCC1)c2=O