Reaction Details
TargetDelta-type opioid receptor
LigandBDBM50195661
Substrate/Competitorn/a
Meas. Tech.ChEMBL_416476 (CHEMBL907189)
IC50 118±n/a nM
Citation Rennison, DMoynihan, HTraynor, JRLewis, JWHusbands, SM Structural determinants of opioid activity in derivatives of 14-aminomorphinones: effects of changes to the chain linking of the C14-amino group to the aryl ring. J Med Chem49:6104-10 (2006) 
 
Delta-type opioid receptor
Name:Delta-type opioid receptor
Type:G Protein-Coupled Receptor (GPCR)
Mol. Mass.:40382.98
Organism:Homo sapiens (Human)
Description:Competition binding assays were carried out using membrane preparations from transfected HN9.10 cells that constitutively expressed the delta opioid receptor.
Residue:372
BDBM50195661
NameBDBM50195661
Synonyms:CHEMBL216365 | N-cyclopropylmethyl-14beta-[4'-(4''-chlorophenyl)-2'-butenamido]-7,8-dihydronorcodeinone
TypeSmall organic molecule
Emp. Form.C31H33ClN2O4
Mol. Mass.533.058
SMILESCOc1ccc2C[C@H]3N(CC4CC4)CC[C@@]45[C@@H](Oc1c24)C(=O)CC[C@@]35NC(=O)C\C=C\c1ccc(Cl)cc1