Reaction Details
TargetMu-type opioid receptor
LigandBDBM50195660
Substrate/Competitorn/a
Meas. Tech.ChEMBL_416468 (CHEMBL907181)
Ki 0.590000±n/a nM
Citation Rennison, DMoynihan, HTraynor, JRLewis, JWHusbands, SM Structural determinants of opioid activity in derivatives of 14-aminomorphinones: effects of changes to the chain linking of the C14-amino group to the aryl ring. J Med Chem49:6104-10 (2006) 
 
Mu-type opioid receptor
Name:Mu-type opioid receptor
Type:Enzyme Catalytic Domain
Mol. Mass.:11165.58
Organism:GUINEA PIG
Description:P97266
Residue:98
BDBM50195660
NameBDBM50195660
Synonyms:CHEMBL384497 | N-cyclopropylmethyl-14beta-[3'-(4'-chlorophenyl)propylamino]-7,8-dihydronorcodeinone
TypeSmall organic molecule
Emp. Form.C30H35ClN2O3
Mol. Mass.507.064
SMILESCOc1ccc2C[C@H]3N(CC4CC4)CC[C@@]45[C@@H](Oc1c24)C(=O)CC[C@@]35NCCCc1ccc(Cl)cc1