Reaction Details
TargetMu-type opioid receptor
LigandBDBM50195658
Substrate/Competitorn/a
Meas. Tech.ChEMBL_416463 (CHEMBL907785)
IC50 3.7±n/a nM
Citation Rennison, DMoynihan, HTraynor, JRLewis, JWHusbands, SM Structural determinants of opioid activity in derivatives of 14-aminomorphinones: effects of changes to the chain linking of the C14-amino group to the aryl ring. J Med Chem49:6104-10 (2006) 
 
Mu-type opioid receptor
Name:Mu-type opioid receptor
Type:G Protein-Coupled Receptor (GPCR)
Mol. Mass.:44789.51
Organism:Homo sapiens (Human)
Description:P35372
Residue:400
BDBM50195658
NameBDBM50195658
Synonyms:CHEMBL387101 | N-cyclopropylmethyl-14beta-[2'-(4''-chlorophenyl)-ethanamino]-7,8-dihydronorcodeinone
TypeSmall organic molecule
Emp. Form.C29H33ClN2O3
Mol. Mass.493.037
SMILESCOc1ccc2C[C@H]3N(CC4CC4)CC[C@@]45[C@@H](Oc1c24)C(=O)CC[C@@]35NCCc1ccc(Cl)cc1