Reaction Details
TargetKappa-type opioid receptor
LigandBDBM50195677
Substrate/Competitorn/a
Meas. Tech.ChEMBL_416469 (CHEMBL907182)
Ki 54±n/a nM
Citation Rennison, DMoynihan, HTraynor, JRLewis, JWHusbands, SM Structural determinants of opioid activity in derivatives of 14-aminomorphinones: effects of changes to the chain linking of the C14-amino group to the aryl ring. J Med Chem49:6104-10 (2006) 
 
Kappa-type opioid receptor
Name:Kappa-type opioid receptor
Type:G Protein-Coupled Receptor (GPCR)
Mol. Mass.:42744.99
Organism:Cavia porcellus (domestic guinea pig)
Description:P41144
Residue:380
BDBM50195677
NameBDBM50195677
Synonyms:(1R,5R,13R,17S)-17-{[(2E)-3-(4-chlorophenyl)prop-2-en-1-yl]amino}-4-(cyclopropylmethyl)-10-methoxy-12-oxa-4-azapentacyclo[9.6.1.0^{1,13}.0^{5,17}.0^{7,18}]octadeca-7(18),8,10-trien-14-one | CHEMBL216251
TypeSmall organic molecule
Emp. Form.C30H33ClN2O3
Mol. Mass.505.048
SMILESCOc1ccc2C[C@H]3N(CC4CC4)CC[C@@]45[C@@H](Oc1c24)C(=O)CC[C@@]35NC\C=C\c1ccc(Cl)cc1